*HEADING
 TEST CLEARANCE DEPENDENT GAP RADIATION (C3D4T)
*PHYSICAL CONSTANTS, ABSOLUTE ZERO=-460., STEFAN=1.E-8
*NODE,NSET=BAR
*NODE
*NSET,NSET=BAR1,GENERATE
*NSET,NSET=LEFT,GENERATE
*ELEMENT,TYPE=C3D4T,ELSET=ROD
*SOLID SECTION,ELSET=ROD,MATERIAL=A1
1.,
*MATERIAL,NAME=A1
*ELASTIC
1.E5,
*EXPANSION
1.E-5,
*CONDUCTIVITY
1.,
*DENSITY
1.,
*SPECIFIC HEAT
1.,
*NODE, NSET=WALL
*ELEMENT, TYPE=HEATCAP, ELSET=HCAP
*HEATCAP, ELSET=HCAP
*ELEMENT,ELSET=RIGID,TYPE=R3D4
*RIGID BODY, REF NODE=9999,ELSET=RIGID,ISOTHERMAL=YES
*SURFACE,TYPE=ELEMENT,NAME=RIGHT
12,s3
11,s3
*SURFACE,TYPE=ELEMENT,NAME=WALL
RIGID,SNEG
*STEP
*DYNAMIC TEMPERATURE-DISPLACEMENT, EXPLICIT
*CONTACT PAIR,INTERACTION=GAP,WEIGHT=0.0
RIGHT,WALL
*SURFACE INTERACTION,NAME=GAP
*GAP RADIATION
*BOUNDARY,TYPE=VELOCITY
BAR1,2
LEFT,1
WALL,1,6,0.0
*BOUNDARY
LEFT,11,11,400.
WALL,11,11,200.
*OUTPUT,FIELD,NUM=1
*ELEMENT OUTPUT,ELSET=ROD
S,LE
*OUTPUT, HISTORY,FREQ=20
*NODE OUTPUT, NSET=BAR
U,NT
** *NODE OUTPUT,NSET=WALL
** U,
*ENERGY OUTPUT,ELSET=ROD
ALLIE,ALLKE,ALLAE
**
** Output requests for qa testing
**
*NSET,NSET=QA_TEST
BAR, 9999
*OUTPUT,FIELD,NUM=1
*NODE OUTPUT,NSET=QA_TEST
U, NT
*OUTPUT,HISTORY,VAR=PRESELECT,TIME INTERVAL=1.25
*FILE OUTPUT,NUM=1
*NODE FILE
U,
NT,
*END STEP