*HEADING
EXPLICIT CFILM AND CFLUX LOADS TEST [C3D6T]
*PREPRINT,ECHO=YES,HISTORY=NO,MODEL=NO
*NODE,NSET=ALL
*ELEMENT,TYPE=C3D6T, ELSET=EALL
*SOLID SECTION,MATERIAL=A1, ELSET=EALL
*MATERIAL,NAME=A1
*ELASTIC
1.0,0.0
*CONDUCTIVITY
1.0,
*DENSITY
1.0,
*SPECIFIC HEAT
1.0,
*EXPANSION
0.0,
*NODE,NSET=REFNODE
*RIGID BODY,REF NODE=9999,ELSET=EALL,ISOTHERMAL=YES
*ELEMENT,TYPE=HEATCAP,ELSET=CAP
*HEATCAP,ELSET=CAP
*INITIAL CONDITIONS,TYPE=TEMPERATURE
9999,100
*NSET,NSET=QA_TEST_ALLNODES
ALL,REFNODE
*NSET,NSET=QA_TEST_QA_TEST_ALLNODES
QA_TEST_ALLNODES,
**
*STEP
 COOL DOWN BY CONVECTION
*DYNAMIC TEMPERATURE-DISPLACEMENT, EXPLICIT, DIRECT
*CFILM
*FILE OUTPUT, NUM=1
*NODE FILE,NSET=QA_TEST_ALLNODES
 NT
*OUTPUT,FIELD,NUM=1
*NODE OUTPUT,NSET=QA_TEST_ALLNODES
 NT,
**
*OUTPUT, HISTORY,FREQ=2
*NODE OUTPUT, NSET=ALL
NT,
*NODE OUTPUT, NSET=REFNODE
NT,
*OUTPUT, HISTORY,TIME INTERVAL=10.0
*ENERGY OUTPUT,VAR=ALL
*OUTPUT, FIELD, NUMBER INTERVAL=1
*NODE OUTPUT, NSET=QA_TEST_QA_TEST_ALLNODES
 NT
*OUTPUT,HISTORY,VARIABLE=PRESELECT,TIMEINT=10
***OUTPUT,HISTORY,VARIABLE=PRESELECT
*ENDSTEP
*****************************************
*STEP
HEATED UP BY PRESCRIBED FLUX
*DYNAMIC TEMPERATURE-DISPLACEMENT, EXPLICIT, DIRECT
*CFILM,OP=NEW
*CFLUX,OP=NEW
9999,11,24,1.0
*FILE OUTPUT, NUM=1
*NODE FILE,NSET=QA_TEST_ALLNODES
 NT
*OUTPUT, FIELD, NUMBER INTERVAL=1
*NODE OUTPUT, NSET=QA_TEST_QA_TEST_ALLNODES
 NT
*OUTPUT,HISTORY,VARIABLE=PRESELECT,TIMEINT=10
*ENDSTEP