*heading
 CONCRETE DAMAGED PLASTICITY: UNIAXIAL CYCLIC TEST (CPE4R)
 with ORIENTATION
*preprint, model=yes
*part, name=part-1
*node, nset=nall
*nset,nset=nside
*element, type=cpe4r, elset=eall
*solid section, elset=eall, material=alle, orientation=ori45
*orientation, name=ori45
*end part
*assembly, name=assembly-1
*instance, name=part-1-1, part=part-1
*end instance
*end assembly
*material,name=alle
*elastic
 2.648e+10, 0.167
*density
 2400.0
*concrete damaged plasticity
*concrete compression hardening
*concrete compression damage
*concrete tension stiffening
*concrete tension damage
*boundary
 assembly-1.part-1-1.1,pinned
 assembly-1.part-1-1.2,2
 assembly-1.part-1-1.4,1
**
**
*step
*dynamic,explicit
 ,1.0
*boundary,type=velocity
 assembly-1.part-1-1.nside,1,1,0.001
*output, field
*element output, elset=assembly-1.part-1-1.eall
 S, LE, PE, PEEQ, PEEQT, DAMAGET, DAMAGEC, SDEG
*node output, nset=assembly-1.part-1-1.nall
 U, V, RF
*output, history, variable=preselect
*element output, elset=assembly-1.part-1-1.eall
 S, PE, LE, PEEQ, PEEQT, DAMAGET, DAMAGEC, SDEG,
 ENER, ELEN
*energy output
 ALLDMD
*end step
**
**
*step
*dynamic,explicit
 ,1.0
*boundary,type=velocity
 assembly-1.part-1-1.nside,1,1,-0.005
*end step