*HEADING
** ABAQUS/EXPLICIT [CAX6M]
** FINE MESH
*NODE,NSET=NALL
*NGEN,NSET=BASE
*NGEN,NSET=TOP
*NGEN,NSET=LEFT
*NGEN,NSET=RIGHT
*NFILL,NSET=NALL
BASE,TOP,60,41
*NGEN,NSET=AXIS
*ELEMENT,TYPE=CAX6M,ELSET=EALL
*ELGEN,ELSET=EALL
*ELSET,GEN,ELSET=SURF_S2
*ELSET,GEN,ELSET=SURF_S3
*ELSET,GEN,ELSET=SURF_S1
*SURFACE, TYPE=ELEMENT, NAME=ASURF
SURF_S2, S2
SURF_S1, S1
SURF_S3, S3
*SOLID SECTION, ELSET=EALL, MATERIAL=METAL
*MATERIAL, NAME=METAL
*DENSITY
7833.,
*ELASTIC
 2E+11, 0.3
*PLASTIC
 7E+08, 0.
 3.7E+09,10.
*NODE
*NSET, NSET=NRIGID
*SURFACE, TYPE=SEGMENTS, NAME=RIGID
START,         0.02,        0.015
 LINE,           0.,        0.015
*RIGID BODY, REF NODE=NRIGID, ANALYTICAL SURFACE=RIGID
*BOUNDARY
NRIGID, 1, 1
NRIGID, 6, 6
*BOUNDARY
BASE, 2, 2
*AMPLITUDE, NAME=RAMP, SMOOTH=0.
0., 0.02, 0.0002, 1., 0.00055, 1.
*STEP
STEP-1
*DYNAMIC, EXPLICIT
, 0.000428
*BULK VISCOSITY
**
*BOUNDARY
AXIS, 1, 1
*BOUNDARY, TYPE=VELOCITY, AMPLITUDE=RAMP
NRIGID, 2, 2, -20.
**
** INTERACTION PROPERTIES
**
*SURFACE INTERACTION, NAME=ROUGH
*FRICTION, ROUGH
*SURFACE BEHAVIOR, PRESSURE-OVERCLOSURE=HARD
**
** INTERACTIONS
**
** INTERACTION: RSURF_TO_ASURF
*CONTACT PAIR, INTERACTION=ROUGH, MECHANICAL CONSTRAINT=KINEMATIC
ASURF, RIGID
**
** OUTPUT REQUESTS
**
*RESTART, WRITE, NUMBER INTERVAL=1, TIME MARKS=NO
*MONITOR, DOF=2, NODE=NRIGID
*OUTPUT, FIELD, VARIABLE=PRESELECT
***OUTPUT, HISTORY, TIME INTERVAL=3E-5
***ENERGY OUTPUT
***ALLAE, ALLCD, ALLFD, ALLIE, ALLKE, ALLPD, ALLSE, ALLVD, ALLWK, ETOTAL
*********************
*OUTPUT,HISTORY,TIME INTERVAL=43.0e-5
*ENERGY OUTPUT,VARIABLE=PRESELECT
*************************
*OUTPUT,FIELD,NUM=1
*NODE OUTPUT,NSET=NALL
U,
*ELEMENT OUTPUT,ELSET=EALL
PEEQ,
***********************
*OUTPUT, HISTORY, TIME INTERVAL=3E-5
*NODE OUTPUT, NSET=NRIGID
U2, RF2
*FILE OUTPUT,NUM=2,TIMEMARKS=YES
*EL FILE
PEEQ,MISES
***OUTPUT,HISTORY,TIME INTERVAL=4.E-7
***NODE OUTPUT,NSET=NRIGID
**U2,RF2
*NODE FILE, NSET=NRIGID
U,RF
**
*END STEP
**==========================================
*STEP
STEP-2
*DYNAMIC, EXPLICIT
, 0.00012
*BULK VISCOSITY
**
*BOUNDARY, TYPE=VELOCITY
NRIGID, 2, 2, -20.
**
** OUTPUT REQUESTS
**
*RESTART, WRITE, NUMBER INTERVAL=1, TIME MARKS=NO
*MONITOR, DOF=2, NODE=NRIGID
*OUTPUT, FIELD, VARIABLE=PRESELECT
***OUTPUT, HISTORY, TIME INTERVAL=6E-6
****ENERGY OUTPUT
***ALLAE, ALLCD, ALLFD, ALLIE, ALLKE, ALLPD, ALLSE, ALLVD, ALLWK, ETOTAL
*********************
*OUTPUT,HISTORY,TIME INTERVAL=12e-5
*ENERGY OUTPUT,VARIABLE=PRESELECT
***********************
*OUTPUT, HISTORY, TIME INTERVAL=6E-6
*NODE OUTPUT, NSET=NRIGID
U2, RF2
*FILE OUTPUT,NUM=2,TIMEMARKS=YES
*EL FILE
PEEQ,MISES
***OUTPUT,HISTORY,TIME INTERVAL=4.E-7
***NODE OUTPUT,NSET=NRIGID
**U2,RF2
*NODE FILE, NSET=NRIGID
U,RF
*END STEP