*Heading
** billet_case1_std_fine_rez.inp
** ABAQUS/Standard:  Case 1 fine mesh rezoning.  Uses billet_case1_std_fine.inp
**
** PARTS
**
*Part, name=RIGID
*End Part
*Part, name=newBillet
*End Part
**
** ASSEMBLY
**
*Assembly, name=Assembly
**
*Instance, name=newBillet-1, part=newBillet
*Node
*Element, type=CAX4R
*Element, type=CAX4R
*Element, type=CAX4R
*Nset, nset=AXIS
*Elset, elset=AXIS, generate
*Nset, nset=MIDDLE
*Elset, elset=MIDDLE
** Region: (BILLET:Picked)
*Elset, elset=_I1, internal, generate
** Section: BILLET
*Solid Section, elset=_I1, material=METAL
1.,
*End Instance
**
*Instance, name=RIGID-1, part=RIGID
*Node
*Nset, nset=RIGID-1-RefPt_, internal
*Surface, type=SEGMENTS, name=RigidSurface_, internal
START,         0.02,           0.
 LINE,           0.,           0.
*Rigid Body, ref node=RIGID-1-RefPt_, analytical surface=RigidSurface_
*End Instance
*Nset, nset=AXIS, instance=newBillet-1
*Elset, elset=AXIS, instance=newBillet-1
*Nset, nset=MIDDLE, instance=newBillet-1
*Elset, elset=MIDDLE, instance=newBillet-1
*Nset, nset=NRIGID, instance=RIGID-1
*Elset, elset=__G27_S4, internal, instance=newBillet-1
*Elset, elset=__G27_S3, internal, instance=newBillet-1, generate
*Elset, elset=__G27_S2, internal, instance=newBillet-1
*Surface, type=ELEMENT, name=ASURF
__G27_S4, S4
__G27_S3, S3
__G27_S2, S2
*End Assembly
**
** MATERIALS
**
*Material, name=METAL
*Elastic
 2e+11, 0.3
*Plastic
   7e+08, 0.
 3.7e+09,10.
**
** INTERACTION PROPERTIES
**
*Surface Interaction, name=ROUGH
1.,
*Friction, rough
*Surface Behavior, pressure-overclosure=HARD
**
** BOUNDARY CONDITIONS
**
** Name: AXIS Type: Displacement/Rotation
*Boundary
AXIS, 1, 1
** Name: FIX_RIGID Type: Displacement/Rotation
*Boundary
NRIGID, 1, 1
NRIGID, 6, 6
** Name: MIDDLE Type: Displacement/Rotation
*Boundary
MIDDLE, 2, 2
**
** INTERACTIONS
**
** Interaction: RIGID to ASURF
*Contact Pair, interaction=ROUGH
ASURF, RIGID-1.RigidSurface_
*MAP SOLUTION, STEP=1, INC=42, UNBALANCED STRESS=STEP
** ----------------------------------------------------------------
**
** STEP: Step-1
**
*Step, nlgeom, inc=200
Step-1: REZONED MESH MOVE TO 100 PERCENT DIE DISPLACEMENT
*Static
0.1, 1., 1e-05, 1.
**
** BOUNDARY CONDITIONS
**
** Name: RIGID_100_PERCENT Type: Displacement/Rotation
*Boundary
NRIGID, 2, 2, -0.0024
**
** OUTPUT REQUESTS
**
*Restart, write, frequency=0
*Monitor, dof=2, node=NRIGID, frequency=1
*Output, field, variable=PRESELECT
*Output, history, frequency=1
*Energy Output
ALLAE, ALLCD, ALLFD, ALLIE, ALLKE, ALLPD, ALLSE, ALLVD, ALLWK, ETOTAL
*Output, history, frequency=1
*Node Output, nset=NRIGID
U2, RF2
*El Print, freq=999999
*Node Print, freq=999999
*Contact File, slave=ASURF, frequency=40
*Node File, nset=NRIGID
U,RF
*End Step