*Heading
** Job name: tank3d Model name: Model-1
**
** PARTS
**
*Part, name=cavity
*End Part
*Part, name=structure
*End Part
*Part, name=tank
*End Part
**
** ASSEMBLY
**
*Assembly, name=Assembly
**
*Instance, name=cavity-1, part=cavity
*Node
*Element, type=AC3D8
** Region: (fluid:Picked)
*Elset, elset=_I1, internal, generate
** Section: fluid
*Solid Section, elset=_I1, material=fluid
1.,
*End Instance
**
*Instance, name=structure-1, part=structure
*Node
*Element, type=C3D8R
** Region: (solid:Picked)
*Elset, elset=_I1, internal, generate
** Section: solid
*Solid Section, elset=_I1, material=solid
1.,
*End Instance
**
*Instance, name=tank-1, part=tank
*Node
*Element, type=AC3D8
** Region: (fluid:Picked)
*Elset, elset=_I1, internal, generate
** Section: fluid
*Solid Section, elset=_I1, material=fluid
1.,
*End Instance
*Nset, nset=tank-el, instance=tank-1, generate
*Elset, elset=tank-el, instance=tank-1, generate
*Nset, nset=cavity-el, instance=cavity-1, generate
*Elset, elset=cavity-el, instance=cavity-1, generate
*Nset, nset=structsurf, instance=structure-1, generate
*Elset, elset=structsurf, instance=structure-1, generate
*Nset, nset=edge, instance=tank-1
*Elset, elset=_struct-tank_S4, internal, instance=structure-1
*Elset, elset=_struct-tank_S6, internal, instance=structure-1
*Surface, type=ELEMENT, name=struct-tank
_struct-tank_S4, S4
_struct-tank_S6, S6
*Elset, elset=_struct-cavity_S4, internal, instance=structure-1
*Elset, elset=_struct-cavity_S6, internal, instance=structure-1
*Surface, type=ELEMENT, name=struct-cavity
_struct-cavity_S4, S4
_struct-cavity_S6, S6
*Elset, elset=_cavity_S3, internal, instance=cavity-1
*Elset, elset=_cavity_S4, internal, instance=cavity-1
*Surface, type=ELEMENT, name=cavity
_cavity_S3, S3
_cavity_S4, S4
*Elset, elset=_tank_S5, internal, instance=tank-1
*Elset, elset=_tank_S4, internal, instance=tank-1
*Surface, type=ELEMENT, name=tank
_tank_S5, S5
_tank_S4, S4
** Constraint: struct-cavity
*Tie, name=struct-cavity, adjust=yes,position=2
cavity,struct-cavity
** Constraint: struct-tank
*Tie, name=struct-tank, adjust=yes,position=2
tank,struct-tank
*End Assembly
**
** MATERIALS
**
*Material, name=fluid
*Acoustic Medium
*Density
 0.0011,
*Material, name=solid
*Density
 0.0011,
*Elastic
100.,0.
**
**
** ----------------------------------------------------------------
*Step, nlgeom
*Static
0.1, 1., 1e-05, 1.
**
** BOUNDARY CONDITIONS
**
** Name: BC-4 Type: Displacement/Rotation
*Boundary
structsurf, 1, 1
structsurf, 2, 2,10
structsurf, 3, 3
**
** OUTPUT REQUESTS
**
*ADAPTIVE MESH,ELSET=CAVITY-EL,FREQ=1,MESH=10
*ADAPTIVE MESH,ELSET=TANK-EL,FREQ=1,MESH=100
*ADAPTIVE MESH CONTROLS,NAME=XX,TRANS=180.0
*PRINT,ADAP=YES
*ADAPTIVE MESH CONSTRAINT
Edge,2,,10
*Restart, write, frequency=1
**
** FIELD OUTPUT: F-Output-1
**
*Output, field, variable=PRESELECT
**
** HISTORY OUTPUT: H-Output-1
**
*Output, history, variable=PRESELECT
*El Print, freq=999999
*Node Print, freq=999999
*End Step