*HEADING
 ADAPTIVE MESHING EXAMPLE
 FORGING WITH SINUSOIDAL DIE
 3D - CYLINDRICAL RIGID SURFACE
 Units: N, m
*NODE
*ELEMENT,TYPE=C3D8R,ELSET=BLANK
*SOLID SECTION,MATERIAL=MAT1,ELSET=BLANK,CONTROLS=SECT
0.12,
*SECTION CONTROLS,NAME=SECT,HOURGLASS=STIFFNESS
*MATERIAL,NAME=MAT1
*ELASTIC
200.E+9, .3
*PLASTIC
1.E+8, 0.0
3.1E+9, 10.0
*DENSITY
7800.E+1,
*ELGEN,ELSET=UP
*NSET,NSET=A2,GEN
*NSET,NSET=A1,GEN
*NSET,NSET=B1,GEN
*NSET,NSET=B2,GEN
*NSET,NSET=C1,GEN
*NSET,NSET=C2,GEN
*NFILL,NSET=Z1
A1,A2,96,78
*NFILL,NSET=Z2
B1,B2,96,78
*NFILL,NSET=BOT
C1,C2,96,78
*NSET,NSET=END,GEN
*ELSET,ELSET=TOP,GEN
*ELSET,ELSET=SIDE,GEN
*ELSET,ELSET=SIDE1,GEN
*BOUNDARY
Z1,ZSYMM
END,XSYMM
BOT,YSYMM
9000,1,1
9000,3,6
*RESTART,W,N=20
*SURFACE,TYPE=ELEMENT,NAME=METAL, REGION TYPE=SLIDING
SIDE,S2
SIDE1,S3
TOP,S4
*SURFACE,TYPE=CYLINDER,NAME=RIGID,FILLET RADIUS=.001
START,        0.04000,        0.01000
 LINE,        0.02500,        0.01000
 LINE,        0.02475,        0.01003
 LINE,        0.02450,        0.01012
 LINE,        0.02425,        0.01027
 LINE,        0.02400,        0.01047
 LINE,        0.02375,        0.01073
 LINE,        0.02350,        0.01103
 LINE,        0.02325,        0.01136
 LINE,        0.02300,        0.01172
 LINE,        0.02275,        0.01210
 LINE,        0.02250,        0.01250
 LINE,        0.02225,        0.01289
 LINE,        0.02200,        0.01327
 LINE,        0.02175,        0.01363
 LINE,        0.02150,        0.01397
 LINE,        0.02125,        0.01426
 LINE,        0.02100,        0.01452
 LINE,        0.02075,        0.01473
 LINE,        0.02050,        0.01488
 LINE,        0.02025,        0.01497
** ... 82 like lines cut
*RIGID BODY,REF NODE=9000, ANALYTICAL SURFACE =RIGID
*STEP
*DYNAMIC,EXPLICIT
,0.00033
*BOUNDARY, TYPE=VELOCITY
9000, 2, 2, -20.
*SURFACE INTERACTION, NAME=INTER
*FRICTION
0.2,
*CONTACT PAIR, INTERACTION=INTER
RIGID, METAL
*ADAPTIVE MESH, ELSET=BLANK,FREQUENCY=5
*FILE OUTPUT,NUMBER INTERVAL=1, TIMEMARKS=YES
*EL FILE, ELSET=QA_TEST
 PEEQ,
*NODE FILE, NSET=QA_TEST
 U,
*ENERGY FILE
*OUTPUT,FIELD,number=2
*ELEMENT OUTPUT
peeq,
*node output
u,
*****
*NSET, NSET=QA_TEST_REFN
*ELSET, ELSET=QA_TEST
TOP,
*NSET, NSET=QA_TEST
END,
*OUTPUT, FIELD, TIME MARKS=YES, NUMBER INTERVAL=1
*ELEMENT OUTPUT, ELSET=QA_TEST
PEEQ,
*NODE OUTPUT, NSET=QA_TEST
U,
*NODE OUTPUT, NSET=QA_TEST_REFN
RF,
*OUTPUT, HIST, FREQ=9999
*ENERGY OUTPUT, VAR=PRESELECT
******
*END STEP