*HEADING
ADAPTIVE MESHING EXAMPLE
FORGING WITH DUCK-SHAPED DIE (3D REVOLUTION)
Units - N, mm, sec
*NODE
**
**
*ELEMENT, TYPE=C3D8R, ELSET=BLANK
**
** xsymm
**
*NSET, NSET=XSYMM, GENERATE
**
** zsymm
**
*NSET, NSET=ZSYMM
**
*RESTART,WRITE,NUMBERINTERVAL=2
*NSET,NSET=REF
**
*MATERIAL,NAME=BLANK
*DENSITY
7340.e-9,
*ELASTIC
       2.E5,         0.3
*PLASTIC
      360.,          0.
      390.,          1.
*SOLID SECTION,ELSET=BLANK,MATERIAL=BLANK,CONTROLS=SECT
*SECTION CONTROLS,NAME=SECT,HOURGLASS=ENHANCED, KINEMATICS=ORTHOGONAL
*BOUNDARY
72001,1,6
72000,1,1
72000,3,6
XSYMM,1,1
ZSYMM,3,3
*ELSET,ELSET=OUT
*SURFACE,TYPE=ELEMENT,NAME=BLANK, REGION TYPE=SLIDING
BLANK,
*SURFACE, NAME=TOP, TYPE=REVOLUTION
START, .0, 25.229997
 LINE, 15.71, 24.949997
 LINE, 18.6371, 24.729697
 LINE, 21.55, 24.373797
 LINE, 24.4567, 23.976597
 LINE, 27.3761, 23.684397
 LINE, 29.9775, 22.409497
 LINE, 32.1287, 20.415797
 LINE, 33.832, 18.029097
 LINE, 34.6121, 15.211297
 LINE, 36.7348, 13.304597
 LINE, 39.6458, 13.019797
 LINE, 42.3904, 13.858497
 LINE, 44.2512, 16.115697
 LINE, 46.572499999, 17.824997
 LINE, 49.4593, 18.308497
 LINE, 52.38, 18.089997
 LINE, 76.19, 16.189997
 LINE, 78.7544, 15.803397
 LINE, 81.3444, 15.667597
 LINE, 83.935199999, 15.785597
** ... 43 like lines cut
*SURFACE, NAME=BOT_1, TYPE=REVOLUTION
START,      150.47,       26.19
 LINE,     131.737,       26.19
 LINE,     131.644,     26.1856
 LINE,     131.552,     26.1727
 LINE,     131.462,     26.1514
 LINE,     131.374,     26.1218
 LINE,      131.29,     26.0843
 LINE,     131.209,     26.0389
 LINE,     131.132,     25.9859
 LINE,     130.796,     25.7305
 LINE,      130.46,      25.475
 LINE,     130.124,     25.2195
 LINE,     129.788,     24.9641
 LINE,     129.711,     24.9111
 LINE,      129.63,     24.8657
 LINE,     129.546,     24.8282
 LINE,     129.458,     24.7986
 LINE,     129.368,     24.7773
 LINE,     129.276,     24.7644
 LINE,     129.183,       24.76
 LINE,     105.486,       24.76
** ... 106 like lines cut
*RIGID BODY,REF NODE=72000, ANALYTICAL SURFACE =BOT_1
*RIGID BODY,REF NODE=72001, ANALYTICAL SURFACE =TOP
*STEP
*DYNAMIC,EXPLICIT
,0.107
*VARIABLE MASS SCALING,DT=5.5E-6,TYPE=BELOW MIN,
ELSET=BLANK, FREQUENCY=10
*BOUNDARY,TYPE=VELOCITY
72000,2,2,-166.652
*CONTACT PAIR,INTERACTION=SMOOTH
BLANK,BOT_1
BLANK,TOP
*SURFACE INTERACTION,NAME=SMOOTH
*FILE OUTPUT,TIMEMARKS=YES,NUM=1
*EL FILE,ELSET=OUT
PEEQ,
*NODE FILE,NSET=REF
U,
***OUTPUT,HISTORY,TIME INTERVAL=1.0E-2
***NODE OUTPUT,NSET=REF
**RF1,RF2
***ENERGY OUTPUT
**ALLKE,ALLIE,ALLAE,ALLVD,ALLWK,ETOTAL,
**DT,
*ADAPTIVE MESH,ELSET=BLANK
*output,field,number=2
*element output
peeq,
*node output
u,
*****
*NSET, NSET=QA_TEST_REFN
REF,
*ELSET, ELSET=QA_TEST
OUT,
*NSET, NSET=QA_TEST
XSYMM,
*OUTPUT, FIELD, TIME MARKS=YES, NUMBER INTERVAL=1
*ELEMENT OUTPUT, ELSET=QA_TEST
PEEQ,
*NODE OUTPUT, NSET=QA_TEST
U,
*NODE OUTPUT, NSET=QA_TEST_REFN
RF,
*OUTPUT, HIST, FREQ=9999
*ENERGY OUTPUT, VAR=PRESELECT
******
*END STEP