*HEADING
ADAPTIVE MESHING EXAMPLE
FORGING WITH DUCK-SHAPED DIE (AXISYMMETRIC)
Units - N, mm, sec
*RESTART,WRITE,NUMBER INTERVAL=50
*NODE,INPUT=ale_duckshape_forg_axind.inp
*ELEMENT, TYPE=CAX4R , ELSET=BLANK,
INPUT=ale_duckshape_forg_axiel.inp
*INCLUDE, INPUT=ale_duckshape_forg_axiset.inp
*NSET,NSET=SIDE
*MATERIAL,NAME=BLANK
*DENSITY
7340.e-9,
*ELASTIC
       2.E5,         0.3
*PLASTIC
      360.,          0.
      390.,          1.
*SOLID SECTION,ELSET=BLANK,MATERIAL=BLANK
*ELSET,ELSET=OUT,GEN
*NSET,NSET=REF
*SURFACE,TYPE=ELEMENT,NAME=BLANK,
REGION TYPE=SLIDING
BLANK,
*SURFACE, NAME=TOP, TYPE=SEGMENTS
*INCLUDE,INPUT=ale_duckshape_forg_axirs.inp
*RIGID BODY,REF NODE=2000,
ANALYTICAL SURFACE =BOT_1
*RIGID BODY,REF NODE=2001,
ANALYTICAL SURFACE =TOP
*STEP
*DYNAMIC,EXPLICIT
,0.105
*BOUNDARY
2000,1
2000,3,6
2001,1,6
SIDE,1,1
*BOUNDARY,TYPE=VELOCITY
2000,2,2,-166.652
*CONTACT PAIR,INTERACTION=SMOOTH
BLANK,TOP
BLANK,BOT_1
*SURFACE INTERACTION,NAME=SMOOTH
*FILE OUTPUT,TIMEMARKS=YES,NUM=1
*EL FILE,ELSET=OUT
PEEQ,
*NODE FILE,NSET=REF
U,
*****
*NSET, NSET=QA_TEST_REF
REF,
*ELSET, ELSET=QA_TEST
OUT,
*NSET, NSET=QA_TEST
SIDE,
*OUTPUT, FIELD, TIME MARKS=YES, NUMBER INTERVAL=1
*ELEMENT OUTPUT, ELSET=QA_TEST
PEEQ,
*NODE OUTPUT, NSET=QA_TEST
U,
*NODE OUTPUT, NSET=QA_TEST_REF
RF,
*OUTPUT, HIST, FREQ=9999
*ENERGY OUTPUT, VAR=PRESELECT
******
*ADAPTIVE MESH,ELSET=BLANK
*END STEP