*Heading
Pore Pressure Bricks
*PREPRINT, MODEL=YES, HISTORY=YES
*Node, NSET=NALL
**
**
*Element, Type=C3D8RP
*Elgen, Elset=Eall
*Solid Section, Elset=Eall, Material=HKS, Controls=Enhg
1.0
*Section Controls, Name=Enhg, Hourglass=Enhanced
*Material, Name=HKS
*ELASTIC
 6800.,0.22
*DRUCKER PRAGER
*DRUCKER PRAGER HARDENING
*PERMEABILITY,SPECIFIC=3.61e-2
 15.2,
*EXPANSION
 0.32E-05,
*DENSITY
30.0
*INITIAL CONDITIONS, TYPE=RATIO
NALL, 0.3
*Step, Nlgeom, INC=1000, UNSYMM=YES, AMPLITUDE=RAMP
*SOILS,CONSOLIDATION,UTOL=10
*Boundary
13, 1, 3
14, 1, 3
15, 1, 3
28, 1, 3
29, 1, 3
30, 1, 3
43, 1, 3
44, 1, 3
*Dload
Eall, Grav, 2.0, 0.0, 0.0, -1.0
*ADAPTIVE MESH, ELSET=Eall, Mesh Sweeps=2, Freq=1
*ADAPTIVE MESH CONSTRAINT
*EL PRINT, TOTALS=YES
EVOL
PE
PEEQ
*NODE PRINT
U
*EL PRINT, ELSET=EALL
VOLC
*OUTPUT, FIELD, VARIABLE=PRESELECT
*OUTPUT, HISTORY
*ELEMENT OUTPUT, ELSET=EALL
VOLC
*End Step