*Heading
Pore Pressure Bricks
*PREPRINT, MODEL=YES, HISTORY=YES
*Node, NSET=NALL
**
**
*Element, Type=C3D8PH
*Elgen, Elset=Eall
*Solid Section, Elset=Eall, Material=HKS
1.0
*Material, Name=HKS
*ELASTIC
 6800.,0.22
*DRUCKER PRAGER
*DRUCKER PRAGER HARDENING
*PERMEABILITY,SPECIFIC=3.61e-2
 15.2,
*EXPANSION
 0.32E-05,
*DENSITY
30.0
*INITIAL CONDITIONS, TYPE=RATIO
NALL, 0.3
*Step, Nlgeom, INC=1000, UNSYMM=YES, AMPLITUDE=RAMP
*SOILS,CONSOLIDATION,UTOL=10
*Boundary
13, 1, 3
14, 2, 3
15, 2, 3
28, 1, 1
28, 3, 3
43, 1, 1
43, 3, 3
44, 3, 3
*Dload
Eall, Grav, 3.0, 0.0, 0.0, 1.0
*ADAPTIVE MESH, ELSET=Eall, Mesh Sweeps=20, Freq=100
*EL PRINT, TOTALS=YES
EVOL
PE
PEEQ
*NODE PRINT
U
*EL PRINT, ELSET=EALL
VOLC
*OUTPUT, FIELD, VARIABLE=ALL
*OUTPUT, HISTORY
*ELEMENT OUTPUT, ELSET=EALL
VOLC
*CONTROLS, ANALYSIS=DISCONTINUOUS
*End Step
*Step
*Soils, consolidation, UTOL=10
*End Step