*Heading
** Job name: ale_c3d8h Model name: Model-1
*Preprint, echo=YES, model=YES, history=YES, contact=NO
**
** PARTS
**
*Part, name=Part-1
*End Part
**
** ASSEMBLY
**
*Assembly, name=Assembly
**
*Instance, name=Part-1-1, part=Part-1
*Node
*Element, type=C3D8H
** Region: (Section-1:Picked)
*Elset, elset=_PickedSet2, internal, generate
** Section: Section-1
*Solid Section, elset=_PickedSet2, material=Material-1
1.,
*End Instance
*Nset, nset=_PickedSet4, internal, instance=Part-1-1
*Elset, elset=_PickedSet4, internal, instance=Part-1-1
*Nset, nset=_PickedSet5, internal, instance=Part-1-1, generate
*Elset, elset=_PickedSet5, internal, instance=Part-1-1, generate
*Nset, nset=_PickedSet6, internal, instance=Part-1-1, generate
*Elset, elset=_PickedSet6, internal, instance=Part-1-1, generate
*Nset, nset=ADAPT, instance=Part-1-1, generate
*Elset, elset=ADAPT, instance=Part-1-1, generate
*End Assembly
**
** MATERIALS
**
*Material, name=Material-1
*Density
4.,
*Hyperelastic
80.,   20., 0.001
** ----------------------------------------------------------------
**
** STEP: Step-1
**
*Step, name=Step-1, nlgeom=YES
Gravity Loading
*Static
0.2, 1., 1e-05, 1.
**
** BOUNDARY CONDITIONS
**
** Name: BC-1 Type: Displacement/Rotation
*Boundary
_PickedSet4, 3, 3
** Name: BC-2 Type: Displacement/Rotation
*Boundary
_PickedSet5, 1, 1
** Name: BC-3 Type: Displacement/Rotation
*Boundary
_PickedSet6, 2, 2
**
** LOADS
**
** Name: Load-1   Type: Gravity
*Dload
, GRAV, 1., 0., 0., -1.
**
** OUTPUT REQUESTS
**
*Restart, write, frequency=1
**
** FIELD OUTPUT: F-Output-1
**
*Output, field, variable=PRESELECT
**
** HISTORY OUTPUT: H-Output-1
**
*Output, history, variable=PRESELECT
**
** HISTORY OUTPUT: H-Output-2
**
*Output, history
*Element Output, elset=ADAPT
VOL,
*End Step
** ----------------------------------------------------------------
**
** STEP: Step-2
**
*Step, name=Step-2, nlgeom=YES
ALE
*Static
1., 1., 1e-05, 1.
**
** OUTPUT REQUESTS
**
*Restart, write, frequency=1
**
** FIELD OUTPUT: F-Output-1
**
*Output, field, variable=PRESELECT
**
** HISTORY OUTPUT: H-Output-1
**
*Output, history, variable=PRESELECT
**
** HISTORY OUTPUT: H-Output-2
**
*Output, history
*Element Output, elset=ADAPT
VOL,
*ADAPTIVE MESH, ELSET=ADAPT, FREQUENCY=1, MESH SWEEP=10
*End Step
** ----------------------------------------------------------------
**
** STEP: Step-3
**
*Step, name=Step-3, nlgeom=YES
STRESS REDISTRIBUTION
*Static
1., 1., 1e-05, 1.
**
** OUTPUT REQUESTS
**
*Restart, write, frequency=1
**
** FIELD OUTPUT: F-Output-1
**
*Output, field, variable=PRESELECT
**
** HISTORY OUTPUT: H-Output-1
**
*Output, history, variable=PRESELECT
**
** HISTORY OUTPUT: H-Output-2
**
*Output, history
*Element Output, elset=ADAPT
VOL,
*End Step