*HEADING
**
*PREPRINT, ECHO=YES, MODEL=NO, HISTORY=NO
*NODE,NSET=BEAMS,SYSTEM=C
********************************
*NODE,NSET=STIFFNER
*****
*NGEN,NSET=BEAMS,LINE=C
*NSET,NSET=OUT
*NSET,NSET=QA_TEST
OUT,
*ELEMENT,TYPE=SAX1,ELSET=BEAMS
*ELGEN,ELSET=BEAMS
*ELEMENT,TYPE=SAX1,ELSET=STIFFNER
******************
*INCLUDE,INPUT=acoustic_prolate_xplelem.inp
*INCLUDE,INPUT=acoustic_prolate.inp
*NSET, NSET=INNER, GENERATE
*NSET, NSET=OUTER, GENERATE
*ELSET, ELSET=OUTER,  GENERATE
*ELSET, ELSET=INNER, GENERATE
*SURFACE, TYPE=ELEMENT, NAME=SLAVE
INNER, S1
*ELSET, ELSET=_SURF-2_S3, GENERATE
*SURFACE, TYPE=ELEMENT, NAME=OUTER
_SURF-2_S3, S3
*SURFACE,TYPE=ELEMENT,NAME=MASTER
BEAMS,SPOS
*TIE,NAME=COUPLING,adjust=no
SLAVE,MASTER
************************************
*MATERIAL,NAME=WATER
*DENSITY
1000.0,
*ACOUSTIC MEDIUM,BULK MODULUS
*ACOUSTIC MEDIUM,VOLUMETRICDRAG
*IMPEDANCE PROPERTY,NAME=BGT_AUTO,TYPE=PROLATE
*SOLID SECTION,MATERIAL=WATER,ELSET=ACOUSTIC
0.1
*******************
*SHELL SECTION,MATERIAL=MAT1,ELSET=BEAMS
0.1
*SHELL SECTION,MATERIAL=MAT1,ELSET=STIFFNER
0.1
*MATERIAL,NAME=MAT1
*ELASTIC
207E9,0.3
*DENSITY
7800
*************************
*AMPLITUDE,DEFINITION=PERIODIC,NAME=SINE
1,628.3185,0,0.0
0.0,1.0
**********************
*STEP
*DYNAMIC,EXPLICIT,DIRECT
2.5e-5,0.003
*IMPEDANCE
OUTER,I3,BGT_AUTO
*BOUNDARY,AMP=SINE,TYPE=ACCEL
2075,2,2,1.0E4
*BOUNDARY
25001,1,1,0.0
25071,1,1,0.0
25001,6,6,0.0
25071,6,6,0.0
2055,1,1,0.0
2055,6,6,0.0
*OUTPUT,FIELD,NUMBER=5
*NODE OUTPUT
POR
*OUTPUT,FIELD,NUMBER=2
*NODE OUTPUT,NSET=QA_TEST
por
*OUTPUT,HISTORY,freq=1
*NODE OUTPUT,NSET=INNER
POR
*NODE OUTPUT,NSET=BEAMS
POR
*END STEP
************************